Target
Tyrosine-protein kinase JAK1 [866-1154]
Ligand
BDBM264186
Substrate
Meas. Tech.
Enzyme Inhibition Studies
IC50
426±n/a nM
Citation
 Astrand, AGrimster, NKawatkar, SKettle, JGNilsson, MKRuston, LSu, QVasbinder, MWinter-Holt, JJWoessner, RDChuaqui, CEMcCabe, J Compounds and methods for inhibiting JAK US Patent  US10167276 Publication Date 1/1/2019 
Target
Name:
Tyrosine-protein kinase JAK1 [866-1154]
Synonyms:
JAK1 JAK1A JAK1_HUMAN Tyrosine-protein kinase JAK1 (aa 866-1154)
Type:
Protein
Mol. Mass.:
33185.74
Organism:
Homo sapiens (Human)
Description:
P23458[866-1154]
Residue:
289
  
Inhibitor
Name:
BDBM264186
Synonyms:
(2R)-N-(3-{2-[(3- ethoxy-1-methyl-1H- pyrazol-4-yl)amino]-5- fluoropyrimidin-4-yl}- 1H-indol-7-yl)-2- [4-(2-methoxyethyl) piperazin-1-yl]propanamide US10654835, Example 9 US9714236, 9
Type:
Small organic molecule
Emp. Form.:
C28H36FN9O3
Mol. Mass.:
565.6423
SMILES:
CCOc1nn(C)cc1Nc1ncc(F)c(n1)-c1c[nH]c2c(NC(=O)[C@@H](C)N3CCN(CCOC)CC3)cccc12
: