Target
Tyrosine-protein kinase JAK1 [866-1154]
Ligand
BDBM264195
Substrate
Meas. Tech.
Enzyme Inhibition Studies
IC50
19.0±n/a nM
Citation
 Astrand, AGrimster, NKawatkar, SKettle, JGNilsson, MKRuston, LSu, QVasbinder, MWinter-Holt, JJWoessner, RDChuaqui, CEMcCabe, J Compounds and methods for inhibiting JAK US Patent  US10167276 Publication Date 1/1/2019 
Target
Name:
Tyrosine-protein kinase JAK1 [866-1154]
Synonyms:
JAK1 JAK1A JAK1_HUMAN Tyrosine-protein kinase JAK1 (aa 866-1154)
Type:
Protein
Mol. Mass.:
33185.74
Organism:
Homo sapiens (Human)
Description:
P23458[866-1154]
Residue:
289
  
Inhibitor
Name:
BDBM264195
Synonyms:
(2R)-2-(4-ethylpiperazin- 1-yl)-N-(3- {2-[(3-methoxy-1- methyl-1H-pyrazol-4-yl) amino]-5- methylpyrimidin-4-yl}- 1H-indol-7-yl)propanamide US10654835, Example 16 US9714236, 16
Type:
Small organic molecule
Emp. Form.:
C27H35N9O2
Mol. Mass.:
517.6259
SMILES:
CCN1CCN(CC1)[C@H](C)C(=O)Nc1cccc2c(c[nH]c12)-c1nc(Nc2cn(C)nc2OC)ncc1C
: