Target
Tyrosine-protein kinase JAK1 [866-1154]
Ligand
BDBM264197
Substrate
Meas. Tech.
Enzyme Inhibition Studies
IC50
57.0±n/a nM
Citation
 Astrand, AGrimster, NKawatkar, SKettle, JGNilsson, MKRuston, LSu, QVasbinder, MWinter-Holt, JJWoessner, RDChuaqui, CEMcCabe, J Compounds and methods for inhibiting JAK US Patent  US10167276 Publication Date 1/1/2019 
Target
Name:
Tyrosine-protein kinase JAK1 [866-1154]
Synonyms:
JAK1 JAK1A JAK1_HUMAN Tyrosine-protein kinase JAK1 (aa 866-1154)
Type:
Protein
Mol. Mass.:
33185.74
Organism:
Homo sapiens (Human)
Description:
P23458[866-1154]
Residue:
289
  
Inhibitor
Name:
BDBM264197
Synonyms:
(2R)-2-[(3R)-3,4- dimethylpiperazin-1- yl]-N-(3-{2-[(3-methoxy- 1-methyl-1H-pyrazol- 4-yl)amino]-5- methylpyrimidin-4-yl}- 1H-indol-7- yl)propanamide US10654835, Example 18 US9714236, 18
Type:
Small organic molecule
Emp. Form.:
C27H35N9O2
Mol. Mass.:
517.6259
SMILES:
COc1nn(C)cc1Nc1ncc(C)c(n1)-c1c[nH]c2c(NC(=O)[C@@H](C)N3CCN(C)[C@H](C)C3)cccc12
: