Target
Tyrosine-protein kinase JAK1 [866-1154]
Ligand
BDBM264217
Substrate
Meas. Tech.
Enzyme Inhibition Studies
IC50
8.00±n/a nM
Citation
 Astrand, AGrimster, NKawatkar, SKettle, JGNilsson, MKRuston, LSu, QVasbinder, MWinter-Holt, JJWoessner, RDChuaqui, CEMcCabe, J Compounds and methods for inhibiting JAK US Patent  US10167276 Publication Date 1/1/2019 
Target
Name:
Tyrosine-protein kinase JAK1 [866-1154]
Synonyms:
JAK1 JAK1A JAK1_HUMAN Tyrosine-protein kinase JAK1 (aa 866-1154)
Type:
Protein
Mol. Mass.:
33185.74
Organism:
Homo sapiens (Human)
Description:
P23458[866-1154]
Residue:
289
  
Inhibitor
Name:
BDBM264217
Synonyms:
(2R)-N-(3-{5-bromo- 2-[(3-methoxy-1- methyl-1H-pyrazol-4- yl)amino]pyrimidin-4- yl}-1H-indol-7-yl)-2- (4-methylpiperazin-1- yl)propanamide US10654835, Example 37 US9714236, 37
Type:
Small organic molecule
Emp. Form.:
C25H30BrN9O2
Mol. Mass.:
568.469
SMILES:
COc1nn(C)cc1Nc1ncc(Br)c(n1)-c1c[nH]c2c(NC(=O)[C@@H](C)N3CCN(C)CC3)cccc12
: