Target
Tyrosine-protein kinase JAK3 [811-1124]
Ligand
BDBM264221
Substrate
Meas. Tech.
Enzyme Inhibition Studies
IC50
>30000±n/a nM
Citation
 Astrand, AGrimster, NKawatkar, SKettle, JGNilsson, MKRuston, LSu, QVasbinder, MWinter-Holt, JJWoessner, RDChuaqui, CEMcCabe, J Compounds and methods for inhibiting JAK US Patent  US10167276 Publication Date 1/1/2019 
Target
Name:
Tyrosine-protein kinase JAK3 [811-1124]
Synonyms:
JAK3 JAK3_HUMAN | Tyrosine-protein kinase JAK3 (aa 811-1124)
Type:
Protein
Mol. Mass.:
35601.85
Organism:
Homo sapiens (Human)
Description:
P52333[811-1124]
Residue:
314
  
Inhibitor
Name:
BDBM264221
Synonyms:
(2R)-N-(3-{2-[(1,3- dimethyl-1H-pyrazol- 4-yl)amino]-5- methylpyrimidin-4-yl}- 1H-indol-7-yl)- 2-(4-methylpiperazin-1- yl)propanamide US10654835, Example 41 US9714236, 41
Type:
Small organic molecule
Emp. Form.:
C26H33N9O
Mol. Mass.:
487.5999
SMILES:
C[C@@H](N1CCN(C)CC1)C(=O)Nc1cccc2c(c[nH]c12)-c1nc(Nc2cn(C)nc2C)ncc1C
: