Target
Tyrosine-protein kinase JAK1 [866-1154]
Ligand
BDBM264224
Substrate
Meas. Tech.
Enzyme Inhibition Studies
IC50
<4.00±n/a nM
Citation
 Astrand, AGrimster, NKawatkar, SKettle, JGNilsson, MKRuston, LSu, QVasbinder, MWinter-Holt, JJWoessner, RDChuaqui, CEMcCabe, J Compounds and methods for inhibiting JAK US Patent  US10167276 Publication Date 1/1/2019 
Target
Name:
Tyrosine-protein kinase JAK1 [866-1154]
Synonyms:
JAK1 JAK1A JAK1_HUMAN Tyrosine-protein kinase JAK1 (aa 866-1154)
Type:
Protein
Mol. Mass.:
33185.74
Organism:
Homo sapiens (Human)
Description:
P23458[866-1154]
Residue:
289
  
Inhibitor
Name:
BDBM264224
Synonyms:
(2R)-N-(3-{2-[(3- Methoxy-1-methyl- 1H-pyrazol-4-yl)amino]-5- methylpyrimidin-4-yl}- 1H-indol-7-yl)- 2-(4-methylpiperazin-1- yl)butanamide US10654835, Example 44 US9714236, 44
Type:
Small organic molecule
Emp. Form.:
C27H35N9O2
Mol. Mass.:
517.6259
SMILES:
CC[C@@H](N1CCN(C)CC1)C(=O)Nc1cccc2c(c[nH]c12)-c1nc(Nc2cn(C)nc2OC)ncc1C
: