Target
Coagulation factor XI
Ligand
BDBM313742
Substrate
Meas. Tech.
Measurement of FXIa Inhibition
IC50
220±n/a nM
Citation
 Röhrig, SJimenez Nunez, ESchlemmer, KTersteegen, ATeller, HHillisch, AHeitmeier, SSchmidt, MVAckerstaff, JStampfuß, J Substituted oxopyridine derivatives US Patent  US10167280 Publication Date 1/1/2019 
Target
Name:
Coagulation factor XI
Synonyms:
Coagulation factor XIa Coagulation factor XIa light chain FA11_HUMAN Factor XIa PTA | Plasma thromboplastin antecedent
Type:
Enzyme
Mol. Mass.:
70130.58
Organism:
Homo sapiens (Human)
Description:
P03951
Residue:
625
  
Inhibitor
Name:
BDBM313742
Synonyms:
5-({2-[4-(5-Chloro-2-cyano-4-fluorophenyl)-5-methoxy-2-oxopyridin-1(2H)-yl]-4-methoxybutanoyl}amino)pyridine-2-carboxamide (racemate) | US10167280, Example 47
Type:
Small organic molecule
Emp. Form.:
C24H21ClFN5O5
Mol. Mass.:
513.905
SMILES:
COCCC(C(=O)Nc1ccc(nc1)C(N)=O)n1cc(OC)c(cc1=O)-c1cc(Cl)c(F)cc1C#N
: