Target
Coagulation factor XI
Ligand
BDBM313725
Substrate
Meas. Tech.
Measurement of FXIa Inhibition
IC50
17.0±n/a nM
Citation
 Röhrig, SJimenez Nunez, ESchlemmer, KTersteegen, ATeller, HHillisch, AHeitmeier, SSchmidt, MVAckerstaff, JStampfuß, J Substituted oxopyridine derivatives US Patent  US10167280 Publication Date 1/1/2019 
Target
Name:
Coagulation factor XI
Synonyms:
Coagulation factor XIa Coagulation factor XIa light chain FA11_HUMAN Factor XIa PTA | Plasma thromboplastin antecedent
Type:
Enzyme
Mol. Mass.:
70130.58
Organism:
Homo sapiens (Human)
Description:
P03951
Residue:
625
  
Inhibitor
Name:
BDBM313725
Synonyms:
5-({2-[4-(2-Cyano-5-methylphenyl)-5-methoxy-2-oxopyridin-1(2H)-yl]-3-(1-methyl-1H-pyrazol-3-yl)propanoyl}amino)pyridine-2-carboxamide (racemate) | US10167280, Example 30
Type:
Small organic molecule
Emp. Form.:
C27H25N7O4
Mol. Mass.:
511.5319
SMILES:
COc1cn(C(Cc2ccn(C)n2)C(=O)Nc2ccc(nc2)C(N)=O)c(=O)cc1-c1cc(C)ccc1C#N
: