Target
Coagulation factor XI
Ligand
BDBM313727
Substrate
Meas. Tech.
Measurement of FXIa Inhibition
IC50
11.0±n/a nM
Citation
 Röhrig, SJimenez Nunez, ESchlemmer, KTersteegen, ATeller, HHillisch, AHeitmeier, SSchmidt, MVAckerstaff, JStampfuß, J Substituted oxopyridine derivatives US Patent  US10167280 Publication Date 1/1/2019 
Target
Name:
Coagulation factor XI
Synonyms:
Coagulation factor XIa Coagulation factor XIa light chain FA11_HUMAN Factor XIa PTA | Plasma thromboplastin antecedent
Type:
Enzyme
Mol. Mass.:
70130.58
Organism:
Homo sapiens (Human)
Description:
P03951
Residue:
625
  
Inhibitor
Name:
BDBM313727
Synonyms:
5-({2-[4-(5-Chloro-2-cyanophenyl)-5-methoxy-2-oxopyridin-1(2H)-yl]-3-(1,3-oxazol-3-yl)propanoyl}amino)-N-methylpyridine-2-carboxamide (racemate) | US10167280, Example 32
Type:
Small organic molecule
Emp. Form.:
C26H21ClN6O5
Mol. Mass.:
532.935
SMILES:
CNC(=O)c1ccc(NC(=O)C(Cc2cnco2)n2cc(OC)c(cc2=O)-c2cc(Cl)ccc2C#N)cn1
: