Target
Potassium voltage-gated channel subfamily H member 2
Ligand
BDBM313753
Substrate
Meas. Tech.
hERG Inhibition
IC50
>100000±n/a nM
Citation
 Springer, CJMarais, RGirotti, RNiculescu-Duvaz, DNiculescu-Duvaz, IZambon, A 1-(5-tert-butyl-2-aryl-pyrazol-3-yl)-3-[2-fluoro-4-[(3-oxo-4H-pyrido [2, 3-B]pyrazin- 8-yl)oxy]phenyl]urea derivatives as RAF inhibitors for the treatment of cancer US Patent  US10167282 Publication Date 1/1/2019 
Target
Name:
Potassium voltage-gated channel subfamily H member 2
Synonyms:
1,3-beta-glucan synthase component GLS2 ERG Eag-related protein 1 Ether-a-go-go-related gene (HERG) Ether-a-go-go-related gene potassium channel 1 Ether-a-go-go-related gene potassium channel 1 (hERG1) Ether-a-go-go-related protein 1 H-ERG KCNH2 Potassium voltage-gated channel subfamily H member 2 (hERG) Voltage-gated potassium channel subunit Kv11.1 hERG Potassium Channel 1 | putative potassium channel subunit
Type:
Multi-pass membrane protein
Mol. Mass.:
126672.65
Organism:
Homo sapiens (Human)
Description:
Q12809
Residue:
1159
  
Inhibitor
Name:
BDBM313753
Synonyms:
US10167282, Compound TBAP-04
Type:
Small organic molecule
Emp. Form.:
C28H26FN7O4
Mol. Mass.:
543.5489
SMILES:
COc1cccc(c1)-n1nc(cc1NC(=O)Nc1ccc(Oc2ccnc3[nH]c(=O)cnc23)cc1F)C(C)(C)C
: