Target
Heat shock protein HSP 90-alpha
Ligand
BDBM313756
Substrate
Meas. Tech.
Biological Testing
EC50
50.8±4 nM
Citation
 Chiosis, GHe, HLlauger-Bufi, LKim, JLarson, SMSmith-Jones, P Small-molecule HSP90 inhibitors US Patent  US10167285 Publication Date 1/1/2019 
Target
Name:
Heat shock protein HSP 90-alpha
Synonyms:
HS90A_HUMAN HSP86 HSP90AA1 HSPCA Heat shock 86 kDa Heat shock protein HSP 90-alpha (HSP90) LAP-2 Lipopolysaccharide-associated protein 2 heat shock protein 90kDa alpha (cytosolic), class A member 1 isoform 2
Type:
Molecular Chaperone
Mol. Mass.:
84623.45
Organism:
Homo sapiens (Human)
Description:
P07900
Residue:
732
  
Inhibitor
Name:
BDBM313756
Synonyms:
US10167285, Example (2exp)
Type:
Small organic molecule
Emp. Form.:
C17H15BrCl2N4S
Mol. Mass.:
458.203
SMILES:
Cc1ncc2NC(Sc3c(Br)ccc(Cl)c3Cl)N(CCCC#C)c2n1
: