Target
Receptor tyrosine-protein kinase erbB-2
Ligand
BDBM313763
Substrate
IC50
45.0±6 nM
Citation
 Chiosis, GHe, HLlauger-Bufi, LKim, JLarson, SMSmith-Jones, P Small-molecule HSP90 inhibitors US Patent  US10167285 Publication Date 1/1/2019 
Target
Name:
Receptor tyrosine-protein kinase erbB-2
Synonyms:
2.7.10.1 CD_antigen=CD340 ERBB2_HUMAN FASN/HER2 HER2 MLN19 NEU Proto-oncogene Neu Tyrosine kinase-type cell surface receptor HER2 | p185erbB2
Type:
Mol. Mass.:
137894.47
Organism:
Homo sapiens (Human)
Description:
P04626
Residue:
1255
  
Inhibitor
Name:
BDBM313763
Synonyms:
US10167285, Example 8
Type:
Small organic molecule
Emp. Form.:
C18H21FIN5O
Mol. Mass.:
469.2951
SMILES:
CC(C)NCCCN1C(Cc2c3Oc3ccc2I)Nc2cnc(F)nc12
: