Target
Bromodomain-containing protein 2 [364-436]
Ligand
BDBM313788
Substrate
Meas. Tech.
Binding Assay
IC50
<100±n/a nM
Citation
 Burns, CGarnier, JSharp, PPFeutrill, JCuzzupe, A Benzodiazepines as bromodomain inhibitors US Patent  US10167292 Publication Date 1/1/2019 
Target
Name:
Bromodomain-containing protein 2 [364-436]
Synonyms:
BRD2 Bromodomain-containing protein 2 (BRD2)(BD2) KIAA9001 | RING3
Type:
Protein
Mol. Mass.:
8615.14
Organism:
Homo sapiens (Human)
Description:
BD2 (364-436 aa) of P25440
Residue:
73
  
Inhibitor
Name:
BDBM313788
Synonyms:
US10167292, Example 32
Type:
Small organic molecule
Emp. Form.:
C18H15ClN4O2
Mol. Mass.:
354.79
SMILES:
Cc1nnn2CCN(c3ccc(Cl)cc3)c3cc(ccc3-c12)C(O)=O
: