Target
Leucine-rich repeat serine/threonine-protein kinase 2
Ligand
BDBM162018
Substrate
Meas. Tech.
LRRK2 Kinase Assay
IC50
>500±n/a nM
Citation
 Krishna Reddy, YV Substituted 5-(pyrazin-2-yl)-1H-pyrazolo [3, 4-B] pyridine and pyrazolo [3, 4-B] pyridine derivatives as protein kinase inhibitors US Patent  US9669028 Publication Date 6/6/2017 
Target
Name:
Leucine-rich repeat serine/threonine-protein kinase 2
Synonyms:
Dardarin LRRK2_HUMAN Leucine-rich repeat serine/threonine-protein kinase 2 PARK8
Type:
Protein
Mol. Mass.:
286113.20
Organism:
Homo sapiens (Human)
Description:
Q5S007
Residue:
2527
  
Inhibitor
Name:
BDBM162018
Synonyms:
US9669028, 22 N-(1-(4-fluorobenzyl)piperidin-3-yl)-3-methyl-1H-pyrazolo[3,4-b]pyridin-5-amine
Type:
Small organic molecule
Emp. Form.:
C19H22FN5
Mol. Mass.:
339.4099
SMILES:
Cc1n[nH]c2ncc(NC3CCCN(Cc4ccc(F)cc4)C3)cc12
: