Target
Dual specificity tyrosine-phosphorylation-regulated kinase 1A
Ligand
BDBM162228
Substrate
Meas. Tech.
DYRK1A, DYRK1B, DYRK2 and DYRK3 Inhibition Assay
pH
7.5±n/a
IC50
>1000±n/a nM
Comments
extracted
Citation
 Krishna Reddy, YV Substituted 5-(pyrazin-2-yl)-1H-pyrazolo [3, 4-B] pyridine and pyrazolo [3, 4-B] pyridine derivatives as protein kinase inhibitors US Patent  US9669028 Publication Date 6/6/2017 
Target
Name:
Dual specificity tyrosine-phosphorylation-regulated kinase 1A
Synonyms:
DYR1A_HUMAN DYRK1A Dual specificity YAK1-related kinase 1A (Dyrk1A) Dual-specificity tyrosine-phosphorylation regulated kinase 1A HP86 MNBH
Type:
Enzyme
Mol. Mass.:
85616.61
Organism:
Homo sapiens (Human)
Description:
Q13627
Residue:
763
  
Inhibitor
Name:
BDBM162228
Synonyms:
US9669028, 51 6-(3-methyl-1H-pyrazolo[3,4-b]pyridin-5-yl)-N-(1-methylpyrrolidin-3-yl)pyrazin-2-amine
Type:
Small organic molecule
Emp. Form.:
C16H19N7
Mol. Mass.:
309.369
SMILES:
CN1CCC(C1)Nc1cncc(n1)-c1cnc2[nH]nc(C)c2c1
: