Target
Leucine-rich repeat serine/threonine-protein kinase 2
Ligand
BDBM162327
Substrate
Meas. Tech.
LRRK2 Kinase Assay
IC50
>1000±n/a nM
Citation
 Krishna Reddy, YV Substituted 5-(pyrazin-2-yl)-1H-pyrazolo [3, 4-B] pyridine and pyrazolo [3, 4-B] pyridine derivatives as protein kinase inhibitors US Patent  US9669028 Publication Date 6/6/2017 
Target
Name:
Leucine-rich repeat serine/threonine-protein kinase 2
Synonyms:
Dardarin LRRK2_HUMAN Leucine-rich repeat serine/threonine-protein kinase 2 PARK8
Type:
Protein
Mol. Mass.:
286113.20
Organism:
Homo sapiens (Human)
Description:
Q5S007
Residue:
2527
  
Inhibitor
Name:
BDBM162327
Synonyms:
US9669028, 74 3-methyl-5-(3-(pyrrolidin-1-yl)pyrazin-2-yl)-1H-pyrazolo[3,4-b]pyridine
Type:
Small organic molecule
Emp. Form.:
C15H16N6
Mol. Mass.:
280.3277
SMILES:
Cc1n[nH]c2ncc(cc12)-c1nccnc1N1CCCC1
: