Target
Dual specificity tyrosine-phosphorylation-regulated kinase 1A
Ligand
BDBM162331
Substrate
Meas. Tech.
DYRK1A, DYRK1B, DYRK2 and DYRK3 Inhibition Assay
pH
7.5±n/a
IC50
<500±n/a nM
Comments
extracted
Citation
 Krishna Reddy, YV Substituted 5-(pyrazin-2-yl)-1H-pyrazolo [3, 4-B] pyridine and pyrazolo [3, 4-B] pyridine derivatives as protein kinase inhibitors US Patent  US9669028 Publication Date 6/6/2017 
Target
Name:
Dual specificity tyrosine-phosphorylation-regulated kinase 1A
Synonyms:
DYR1A_HUMAN DYRK1A Dual specificity YAK1-related kinase 1A (Dyrk1A) Dual-specificity tyrosine-phosphorylation regulated kinase 1A HP86 MNBH
Type:
Enzyme
Mol. Mass.:
85616.61
Organism:
Homo sapiens (Human)
Description:
Q13627
Residue:
763
  
Inhibitor
Name:
BDBM162331
Synonyms:
US9669028, 81 2-(4-((6-(3-methyl-1H-pyrazolo[3,4-b]pyridin-5-yl)pyrazin-2-yl)amino)piperidin-1-yl)ethanol
Type:
Small organic molecule
Emp. Form.:
C18H23N7O
Mol. Mass.:
353.4215
SMILES:
Cc1n[nH]c2ncc(cc12)-c1cncc(NC2CCN(CCO)CC2)n1
: