Target
Leucine-rich repeat serine/threonine-protein kinase 2 [G2019S]
Ligand
BDBM50441090
Substrate
Meas. Tech.
LRRK2 Kinase Assay
IC50
>1000±n/a nM
Citation
 Krishna Reddy, YV Substituted 5-(pyrazin-2-yl)-1H-pyrazolo [3, 4-B] pyridine and pyrazolo [3, 4-B] pyridine derivatives as protein kinase inhibitors US Patent  US9669028 Publication Date 6/6/2017 
Target
Name:
Leucine-rich repeat serine/threonine-protein kinase 2 [G2019S]
Synonyms:
LRRK2 LRRK2_HUMAN Leucine-rich repeat serine/threonine-protein kinase 2 (LRRK2)(G2019S) PARK8
Type:
Mol. Mass.:
286143.23
Organism:
Homo sapiens (Human)
Description:
Q5S007(G2019S)
Residue:
2527
  
Inhibitor
Name:
BDBM50441090
Synonyms:
CHEMBL2430323 | US9669028, 114 N-(3-(3-methyl-1H-pyrazolo[3,4-b]pyridin-5-yl)phenyl)acetamide
Type:
Small organic molecule
Emp. Form.:
C15H14N4O
Mol. Mass.:
266.2979
SMILES:
CC(=O)Nc1cccc(c1)-c1cnc2[nH]nc(C)c2c1
: