Target
Leucine-rich repeat serine/threonine-protein kinase 2
Ligand
BDBM163551
Substrate
Meas. Tech.
LRRK2 Kinase Assay
IC50
<500±n/a nM
Citation
 Krishna Reddy, YV Substituted 5-(pyrazin-2-yl)-1H-pyrazolo [3, 4-B] pyridine and pyrazolo [3, 4-B] pyridine derivatives as protein kinase inhibitors US Patent  US9669028 Publication Date 6/6/2017 
Target
Name:
Leucine-rich repeat serine/threonine-protein kinase 2
Synonyms:
Dardarin LRRK2_HUMAN Leucine-rich repeat serine/threonine-protein kinase 2 PARK8
Type:
Protein
Mol. Mass.:
286113.20
Organism:
Homo sapiens (Human)
Description:
Q5S007
Residue:
2527
  
Inhibitor
Name:
BDBM163551
Synonyms:
US9669028, 145 6-(3-fluoro-1H-pyrrolo[2,3-b]pyridin-5-yl)-N-methyl-N-((tetrahydro-2H-pyran-4-yl)methyl)pyrazin-2-amine
Type:
Small organic molecule
Emp. Form.:
C18H20FN5O
Mol. Mass.:
341.3827
SMILES:
CN(CC1CCOCC1)c1cncc(n1)-c1cnc2[nH]cc(F)c2c1
: