Target
MAP kinase-interacting serine/threonine-protein kinase 2
Ligand
BDBM313927
Substrate
Meas. Tech.
MNK2a In Vitro Kinase Assay (Assay 1)
IC50
2.00±n/a nM
Citation
 Blum, A Sulfoximine substituted quinazolines for pharmaceutical compositions US Patent  US10167296 Publication Date 1/1/2019 
Target
Name:
MAP kinase-interacting serine/threonine-protein kinase 2
Synonyms:
GPRK7 MAP kinase-interacting serine/threonine-protein kinase 2 (MKNK2) MAP-kinase interacting kinase 2 (MNK2) MKNK2_HUMAN | MNK2
Type:
Protein
Mol. Mass.:
51870.79
Organism:
Homo sapiens (Human)
Description:
Q9HBH9
Residue:
465
  
Inhibitor
Name:
BDBM313927
Synonyms:
US10167296, Example 2.38
Type:
Small organic molecule
Emp. Form.:
C22H25FN4O5S
Mol. Mass.:
476.521
SMILES:
COc1c(C)c2c(Nc3ccc(F)cc3O[C@H]3COC[C@@H]3O)ncnc2cc1N=S(C)(C)=O
: