Target
MAP kinase-interacting serine/threonine-protein kinase 1
Ligand
BDBM313931
Substrate
Meas. Tech.
MNK1 In Vitro Kinase Assay (Assay 2)
IC50
52.0±n/a nM
Citation
 Blum, A Sulfoximine substituted quinazolines for pharmaceutical compositions US Patent  US10167296 Publication Date 1/1/2019 
Target
Name:
MAP kinase-interacting serine/threonine-protein kinase 1
Synonyms:
MAP Kinase-Interacting Protein Kinase (MNK1) MAP kinase-interacting serine/threonine-protein kinase 1 (MnK1) MAP-kinase interacting kinase 1 (MNK1) MKNK1 MNK1
Type:
Serine/threonine-protein kinase
Mol. Mass.:
51342.85
Organism:
Homo sapiens (Human)
Description:
Q9BUB5
Residue:
465
  
Inhibitor
Name:
BDBM313931
Synonyms:
US10167296, Example 2.42
Type:
Small organic molecule
Emp. Form.:
C25H27FN4O5S
Mol. Mass.:
514.569
SMILES:
COc1c(C)c2c(Nc3ccc(F)cc3O[C@@H]3CO[C@@H]4CCO[C@H]34)ncnc2cc1N=S1(=O)CCC1
: