Target
Carboxylic ester hydrolase
Ligand
BDBM10452
Substrate
BDBM8978
Meas. Tech.
Enzyme Inhibition Assay
IC50
1800±n/a nM
Citation
 Han, YFLi, CPChow, EWang, HPang, YPCarlier, PR Dual-site binding of bivalent 4-aminopyridine- and 4-aminoquinoline-based AChE inhibitors: contribution of the hydrophobic alkylene tether to monomer and dimer affinities. Bioorg Med Chem 7:2569-75 (1999)  
Target
Name:
Carboxylic ester hydrolase
Synonyms:
Acetylcholinesterase and butyrylcholinesterase (AChE and BChE) Butyrylcholinesterase (BuChE) | butyrylcholinesterase precursor
Type:
Enzyme
Mol. Mass.:
67776.22
Organism:
Rattus norvegicus (rat)
Description:
Residue:
597
  
Inhibitor
Name:
BDBM10452
Synonyms:
Bivalent 4-Aminoquinoline 9f N-[7-(quinolin-4-ylamino)heptyl]quinolin-4-amine dihydrochloride
Type:
Small organic molecule
Emp. Form.:
C25H28N4
Mol. Mass.:
384.5166
SMILES:
C(CCCNc1ccnc2ccccc12)CCCNc1ccnc2ccccc12
:
Substrate
Name:
BDBM8978
Synonyms:
(Propylcarbonylthioethyl)trimethylammonium iodide CHEMBL148530 butyrylthiocholine | butyrylthiocholine chloride
Type:
Small organic molecule
Emp. Form.:
C9H20NOS
Mol. Mass.:
190.326
SMILES:
CCCC(=O)SCC[N+](C)(C)C
: