Target
C-C chemokine receptor type 5
Ligand
BDBM313955
Substrate
Meas. Tech.
Calcium Flux Inhibition Experiment
IC50
1.95±n/a nM
Citation
 Liu, HWu, BZheng, YXie, XJiang, HPeng, PLuo, RLi, JLi, JZhu, YChen, YZhang, HYang, LZhou, YChen, K 1-(3-aminopropyl) substituted cyclic amine compounds, preparation method therefor, and pharmaceutical compositions and uses thereof US Patent  US10167299 Publication Date 1/1/2019 
Target
Name:
C-C chemokine receptor type 5
Synonyms:
C-C CKR-5 CC-CKR-5 CCR5 CCR5_HUMAN CHEMR13 HIV-1 fusion coreceptor
Type:
Enzyme
Mol. Mass.:
40540.21
Organism:
Homo sapiens (Human)
Description:
P51681
Residue:
352
  
Inhibitor
Name:
BDBM313955
Synonyms:
Compound 3 | US10167299, Example 3
Type:
Small organic molecule
Emp. Form.:
C27H39F2N5OS
Mol. Mass.:
519.693
SMILES:
CC(C)c1nnc(C)n1C1CC2CCC(C1)N2CCC(NC(=O)C1CCC(F)(F)CC1)c1cccs1
: