Target
C-C chemokine receptor type 5
Ligand
BDBM313991
Substrate
Meas. Tech.
Calcium Flux Inhibition Experiment
IC50
8.34±n/a nM
Citation
 Liu, HWu, BZheng, YXie, XJiang, HPeng, PLuo, RLi, JLi, JZhu, YChen, YZhang, HYang, LZhou, YChen, K 1-(3-aminopropyl) substituted cyclic amine compounds, preparation method therefor, and pharmaceutical compositions and uses thereof US Patent  US10167299 Publication Date 1/1/2019 
Target
Name:
C-C chemokine receptor type 5
Synonyms:
C-C CKR-5 CC-CKR-5 CCR5 CCR5_HUMAN CHEMR13 HIV-1 fusion coreceptor
Type:
Enzyme
Mol. Mass.:
40540.21
Organism:
Homo sapiens (Human)
Description:
P51681
Residue:
352
  
Inhibitor
Name:
BDBM313991
Synonyms:
US10167299, Example 43
Type:
Small organic molecule
Emp. Form.:
C32H45F2N5O2S
Mol. Mass.:
601.794
SMILES:
CC(C)C(=O)N1CCc2c(C1)nc(C)n2C1CC2CCC(C1)N2CC[C@H](NC(=O)C1CCC(F)(F)CC1)c1ccsc1
: