Target
C-C chemokine receptor type 5
Ligand
BDBM314011
Substrate
Meas. Tech.
Calcium Flux Inhibition Experiment
IC50
12.2±n/a nM
Citation
 Liu, HWu, BZheng, YXie, XJiang, HPeng, PLuo, RLi, JLi, JZhu, YChen, YZhang, HYang, LZhou, YChen, K 1-(3-aminopropyl) substituted cyclic amine compounds, preparation method therefor, and pharmaceutical compositions and uses thereof US Patent  US10167299 Publication Date 1/1/2019 
Target
Name:
C-C chemokine receptor type 5
Synonyms:
C-C CKR-5 CC-CKR-5 CCR5 CCR5_HUMAN CHEMR13 HIV-1 fusion coreceptor
Type:
Enzyme
Mol. Mass.:
40540.21
Organism:
Homo sapiens (Human)
Description:
P51681
Residue:
352
  
Inhibitor
Name:
BDBM314011
Synonyms:
US10167299, Example 125
Type:
Small organic molecule
Emp. Form.:
C25H34ClN5O2S
Mol. Mass.:
504.088
SMILES:
CC(=O)N[C@@H](CCN1C2CCC1CC(C2)n1c(C)nc2CN(CCc12)C(C)=O)c1ccc(Cl)s1
: