Target
C-C chemokine receptor type 5
Ligand
BDBM314026
Substrate
Meas. Tech.
Calcium Flux Inhibition Experiment
IC50
13.7±n/a nM
Citation
 Liu, HWu, BZheng, YXie, XJiang, HPeng, PLuo, RLi, JLi, JZhu, YChen, YZhang, HYang, LZhou, YChen, K 1-(3-aminopropyl) substituted cyclic amine compounds, preparation method therefor, and pharmaceutical compositions and uses thereof US Patent  US10167299 Publication Date 1/1/2019 
Target
Name:
C-C chemokine receptor type 5
Synonyms:
C-C CKR-5 CC-CKR-5 CCR5 CCR5_HUMAN CHEMR13 HIV-1 fusion coreceptor
Type:
Enzyme
Mol. Mass.:
40540.21
Organism:
Homo sapiens (Human)
Description:
P51681
Residue:
352
  
Inhibitor
Name:
BDBM314026
Synonyms:
US10167299, Example 140
Type:
Small organic molecule
Emp. Form.:
C29H42F2N6O2S
Mol. Mass.:
576.745
SMILES:
CNC(=O)c1ccc(s1)[C@H](CCN1C2CCC1CC(C2)n1c(C)nnc1C(C)C)NC(=O)C1CCC(F)(F)CC1
: