Target
Potassium voltage-gated channel subfamily H member 2
Ligand
BDBM313993
Substrate
Meas. Tech.
hERG Inhibition Activity Assay
IC50
840±n/a nM
Citation
 Liu, HWu, BZheng, YXie, XJiang, HPeng, PLuo, RLi, JLi, JZhu, YChen, YZhang, HYang, LZhou, YChen, K 1-(3-aminopropyl) substituted cyclic amine compounds, preparation method therefor, and pharmaceutical compositions and uses thereof US Patent  US10167299 Publication Date 1/1/2019 
Target
Name:
Potassium voltage-gated channel subfamily H member 2
Synonyms:
1,3-beta-glucan synthase component GLS2 ERG Eag-related protein 1 Ether-a-go-go-related gene (HERG) Ether-a-go-go-related gene potassium channel 1 Ether-a-go-go-related gene potassium channel 1 (hERG1) Ether-a-go-go-related protein 1 H-ERG KCNH2 Potassium voltage-gated channel subfamily H member 2 (hERG) Voltage-gated potassium channel subunit Kv11.1 hERG Potassium Channel 1 | putative potassium channel subunit
Type:
Multi-pass membrane protein
Mol. Mass.:
126672.65
Organism:
Homo sapiens (Human)
Description:
Q12809
Residue:
1159
  
Inhibitor
Name:
BDBM313993
Synonyms:
US10167299, Example 65
Type:
Small organic molecule
Emp. Form.:
C29H45N5OS
Mol. Mass.:
511.766
SMILES:
CCc1ccc(s1)[C@H](CCN1C2CCC1CC(C2)n1c(C)nnc1C(C)C)NC(=O)C1CCCCC1
: