Target
Caspase-3
Ligand
BDBM160788
Substrate
Meas. Tech.
In Vitro Inhibitory Activity of Caspase
IC50
10.00±n/a nM
Citation
 Ahlfors, JMekouar, K Selective caspase inhibitors and uses thereof US Patent  US10167313 Publication Date 1/1/2019 
Target
Name:
Caspase-3
Synonyms:
Apopain CASP3 CPP-32 Caspase 3 Caspase-3 subunit p17 SCA-1 Yama protein | caspase-3 preproprotein
Type:
Hydrolase; heterotetramer of two heterodimers
Mol. Mass.:
31607.55
Organism:
Homo sapiens (Human)
Description:
Residue:
277
  
Inhibitor
Name:
BDBM160788
Synonyms:
US10167313, Compound 55 | US9045524, 55
Type:
Small organic molecule
Emp. Form.:
C35H41N5O11S
Mol. Mass.:
739.792
SMILES:
CC(C)[C@H](NC(=O)[C@H](Cc1ccc2ccccc2n1)NC(=O)[C@H](CC(O)=O)NC(=O)OCc1ccccc1)C(=O)N[C@@H](CC(O)=O)\C=C\S(C)(=O)=O
: