Target
cAMP and cAMP-inhibited cGMP 3',5'-cyclic phosphodiesterase 10A [440-779]
Ligand
BDBM164242
Substrate
Meas. Tech.
PDE10A Inhibition Assay
Temperature
298.15±n/a K
IC50
220±n/a nM
Comments
extracted
Citation
 Püschl, ANielsen, JKehler, JKilburn, JPMarigo, MLanggård, M Heteroaromatic phenylimidazole derivatives as PDE10A enzyme inhibitors US Patent  US9669029 Publication Date 6/6/2017 
Target
Name:
cAMP and cAMP-inhibited cGMP 3',5'-cyclic phosphodiesterase 10A [440-779]
Synonyms:
PDE10A PED10A | Phosphodiesterase 10A (PDE10A)
Type:
Mol. Mass.:
39060.01
Organism:
Homo sapiens (Human)
Description:
Q9Y233[440-779]
Residue:
340
  
Inhibitor
Name:
BDBM164242
Synonyms:
US9669029, 2 5,7-Dimethyl-2-[(E)-2-(1-methyl-4-pyridin-3-yl-1H-imidazol-2-yl)-vinyl]-imidazo[1,2-a]pyrimidine
Type:
Small organic molecule
Emp. Form.:
C18H19N6
Mol. Mass.:
319.3837
SMILES:
Cc1cc(C)n2cc(CCc3nc(cn3C)-c3ccnc3)nc2n1
: