Target
cAMP and cAMP-inhibited cGMP 3',5'-cyclic phosphodiesterase 10A [440-779]
Ligand
BDBM164381
Substrate
Meas. Tech.
PDE10A Inhibition Assay
Temperature
298.15±n/a K
IC50
9.20±n/a nM
Comments
extracted
Citation
 Püschl, ANielsen, JKehler, JKilburn, JPMarigo, MLanggård, M Heteroaromatic phenylimidazole derivatives as PDE10A enzyme inhibitors US Patent  US9669029 Publication Date 6/6/2017 
Target
Name:
cAMP and cAMP-inhibited cGMP 3',5'-cyclic phosphodiesterase 10A [440-779]
Synonyms:
PDE10A PED10A | Phosphodiesterase 10A (PDE10A)
Type:
Mol. Mass.:
39060.01
Organism:
Homo sapiens (Human)
Description:
Q9Y233[440-779]
Residue:
340
  
Inhibitor
Name:
BDBM164381
Synonyms:
US9669029, 84 5-Methyl-2-[2-(1-methyl-4-thiophen-2-yl-1H-imidazol-2-yl)-ethyl]-[1,2,4]triazolo[1,5-a]pyridine
Type:
Small organic molecule
Emp. Form.:
C17H19N5S
Mol. Mass.:
325.431
SMILES:
CC1=CC=CC2NC(CCc3nc(cn3C)-c3cccs3)=NN12
: