Target
Cholinesterase
Ligand
BDBM10515
Substrate
BDBM8978
Meas. Tech.
Enzyme Inhibition Assay
pH
8±n/a
Temperature
310.15±n/a K
IC50
>1000000±n/a nM
Citation
 Rosini, MAndrisano, VBartolini, MBolognesi, MLHrelia, PMinarini, ATarozzi, AMelchiorre, C Rational approach to discover multipotent anti-Alzheimer drugs. J Med Chem 48:360-3 (2005)  
Target
Name:
Cholinesterase
Synonyms:
Acylcholine acylhydrolase Butyrylcholine esterase (BChE) Butyrylcholinesterase (BuChE) CHLE_HUMAN Cholinesterases Pseudocholinesterase
Type:
Homotetramer
Mol. Mass.:
68422.27
Organism:
Homo sapiens (Human)
Description:
P06276
Residue:
602
  
Inhibitor
Name:
BDBM10515
Synonyms:
5-(1,2-dithiolan-3-yl)pentanoic acid D,L-Lipoic acid cid_864 | lipoic acid (LA)
Type:
Small organic molecule
Emp. Form.:
C8H14O2S2
Mol. Mass.:
206.326
SMILES:
OC(=O)CCCCC1CCSS1
:
Substrate
Name:
BDBM8978
Synonyms:
(Propylcarbonylthioethyl)trimethylammonium iodide CHEMBL148530 butyrylthiocholine | butyrylthiocholine chloride
Type:
Small organic molecule
Emp. Form.:
C9H20NOS
Mol. Mass.:
190.326
SMILES:
CCCC(=O)SCC[N+](C)(C)C
: