Target
Aldehyde dehydrogenase, mitochondrial
Ligand
BDBM153697
Substrate
Meas. Tech.
ALDH2 Assay
IC50
>10000±n/a nM
Citation
 Cannizzaro, CEGraupe, MGuerrero, JALu, YStrickley, RGVenkataramani, CZablocki, J Compounds for the treatment of addiction US Patent  US9610299 Publication Date 4/4/2017 
Target
Name:
Aldehyde dehydrogenase, mitochondrial
Synonyms:
ALDH class 2 ALDH2 ALDHI Aldehyde dehydrogenase (ALDH2)
Type:
Enzyme
Mol. Mass.:
56382.67
Organism:
Homo sapiens (Human)
Description:
P05091
Residue:
517
  
Inhibitor
Name:
BDBM153697
Synonyms:
US10507215, Compound 14 US9610299, Example 14
Type:
Small organic molecule
Emp. Form.:
C20H17Cl2N2O6P
Mol. Mass.:
483.239
SMILES:
OP(O)(=O)OCn1ccc(cc1=O)-c1ccc(CNC(=O)c2c(Cl)cccc2Cl)cc1
: