Target
Lysine-specific demethylase 5B
Ligand
BDBM314118
Substrate
Meas. Tech.
Enzymatic Assay
IC50
<100±n/a nM
Citation
 Chen, YKKanouni, TNie, ZStafford, JAVeal, JMWallace, MB Histone demethylase inhibitors US Patent  US9611221 Publication Date 4/4/2017 
Target
Name:
Lysine-specific demethylase 5B
Synonyms:
CT31 Histone demethylase JARID1B Jumonji/ARID domain-containing protein 1B KDM5B_HUMAN Lysine-specific demethylase 5B (KDM5Flag-5B-FL) PLU1 RBP2-H1 | Retinoblastoma-binding protein 2 homolog 1
Type:
Protein
Mol. Mass.:
175659.67
Organism:
Homo sapiens (Human)
Description:
Q9UGL1
Residue:
1544
  
Inhibitor
Name:
BDBM314118
Synonyms:
3-[(2-aminobenzyl)amino]pyridine-4-carboxylic acid US10807956, Example 22 US11639333, Example 22 US9725441, Example 22 | US9828343, Example 22
Type:
Small organic molecule
Emp. Form.:
C13H13N3O2
Mol. Mass.:
243.2612
SMILES:
Nc1ccccc1CNc1cnccc1C(O)=O
: