Target
Lysine-specific demethylase 4C
Ligand
BDBM314136
Substrate
Meas. Tech.
Enzymatic Assay
IC50
<100±n/a nM
Citation
 Chen, YKKanouni, TNie, ZStafford, JAVeal, JMWallace, MB Histone demethylase inhibitors US Patent  US9611221 Publication Date 4/4/2017 
Target
Name:
Lysine-specific demethylase 4C
Synonyms:
GASC-1 protein Gene amplified in squamous cell carcinoma 1 protein JMJD2C Jumonji domain-containing protein 2C KDM4C_HUMAN | KIAA0780
Type:
Protein
Mol. Mass.:
119979.01
Organism:
Homo sapiens (Human)
Description:
Q9H3R0
Residue:
1056
  
Inhibitor
Name:
BDBM314136
Synonyms:
3-{[(5-methylfuran-2-yl)methyl]amino}pyridine-4-carboxylic acid US10807956, Example 40 US11639333, Example 40 US9725441, Example 40 | US9828343, Example 40
Type:
Small organic molecule
Emp. Form.:
C12H12N2O3
Mol. Mass.:
232.2353
SMILES:
Cc1ccc(CNc2cnccc2C(O)=O)o1
: