Target
Lysine-specific demethylase 4C
Ligand
BDBM314152
Substrate
Meas. Tech.
Enzymatic Assay
IC50
<100±n/a nM
Citation
 Chen, YKKanouni, TNie, ZStafford, JAVeal, JMWallace, MB Histone demethylase inhibitors US Patent  US9611221 Publication Date 4/4/2017 
Target
Name:
Lysine-specific demethylase 4C
Synonyms:
GASC-1 protein Gene amplified in squamous cell carcinoma 1 protein JMJD2C Jumonji domain-containing protein 2C KDM4C_HUMAN | KIAA0780
Type:
Protein
Mol. Mass.:
119979.01
Organism:
Homo sapiens (Human)
Description:
Q9H3R0
Residue:
1056
  
Inhibitor
Name:
BDBM314152
Synonyms:
3-[(3,4-dihydro-2H-chromen-4-ylmethyl)amino]pyridine-4-carboxylic acid US10807956, Example 58 US11639333, Example 58 US9725441, Example 58 | US9828343, Example 58
Type:
Small organic molecule
Emp. Form.:
C16H16N2O3
Mol. Mass.:
284.3098
SMILES:
OC(=O)c1ccncc1NCC1CCOc2ccccc12
: