Target
Lysine-specific demethylase 4C
Ligand
BDBM314157
Substrate
Meas. Tech.
Enzymatic Assay
IC50
550±n/a nM
Citation
 Chen, YKKanouni, TNie, ZStafford, JAVeal, JMWallace, MB Histone demethylase inhibitors US Patent  US9611221 Publication Date 4/4/2017 
Target
Name:
Lysine-specific demethylase 4C
Synonyms:
GASC-1 protein Gene amplified in squamous cell carcinoma 1 protein JMJD2C Jumonji domain-containing protein 2C KDM4C_HUMAN | KIAA0780
Type:
Protein
Mol. Mass.:
119979.01
Organism:
Homo sapiens (Human)
Description:
Q9H3R0
Residue:
1056
  
Inhibitor
Name:
BDBM314157
Synonyms:
3-({[(6-(propan-2-yloxy)-1,2,3,4-tetrahydronaphthalen-1-yl]methyl}amino)pyridine-4-carboxylic acid US10807956, Example 64 US11639333, Example 64 US9725441, Example 64 | US9828343, Example 64
Type:
Small organic molecule
Emp. Form.:
C20H24N2O3
Mol. Mass.:
340.4162
SMILES:
CC(C)Oc1ccc2C(CNc3cnccc3C(O)=O)CCCc2c1
: