Target
Sodium channel protein type 9 subunit alpha
Ligand
BDBM162396
Substrate
Meas. Tech.
In Vitro Assay
IC50
1420±240 nM
Citation
 Ni, CShao, BTafesse, LYao, JYu, JZhou, X Pyridine compounds and the uses thereof US Patent  US9611222 Publication Date 4/4/2017 
Target
Name:
Sodium channel protein type 9 subunit alpha
Synonyms:
NENA Peripheral sodium channel 1 SCN9A_HUMAN Voltage-gated sodium channel subunit Nav1.7 hNE-Na
Type:
Protein
Mol. Mass.:
226375.97
Organism:
Homo sapiens (Human)
Description:
Q15858
Residue:
1988
  
Inhibitor
Name:
BDBM162396
Synonyms:
US9056832, 15 | US9611222, Example 15
Type:
Small organic molecule
Emp. Form.:
C19H14ClF3N2O3
Mol. Mass.:
410.774
SMILES:
OCC(O)c1cccc(n1)-c1ccc(Oc2ncc(cc2Cl)C(F)(F)F)cc1
: