Target
Sodium channel protein type 9 subunit alpha
Ligand
BDBM162414
Substrate
Meas. Tech.
In Vitro Assay
IC50
500±70 nM
Citation
 Ni, CShao, BTafesse, LYao, JYu, JZhou, X Pyridine compounds and the uses thereof US Patent  US9611222 Publication Date 4/4/2017 
Target
Name:
Sodium channel protein type 9 subunit alpha
Synonyms:
NENA Peripheral sodium channel 1 SCN9A_HUMAN Voltage-gated sodium channel subunit Nav1.7 hNE-Na
Type:
Protein
Mol. Mass.:
226375.97
Organism:
Homo sapiens (Human)
Description:
Q15858
Residue:
1988
  
Inhibitor
Name:
BDBM162414
Synonyms:
US9056832, 33 | US9611222, Example 33
Type:
Small organic molecule
Emp. Form.:
C22H16F3N3O4
Mol. Mass.:
443.3753
SMILES:
NC(=O)c1cc(cc(n1)-c1ccc(Oc2ccc(c(c2)C#N)C(F)(F)F)cc1)[C@H](O)CO
: