Target
Sodium channel protein type 9 subunit alpha
Ligand
BDBM162425
Substrate
Meas. Tech.
In Vitro Assay
IC50
3290±1170 nM
Citation
 Ni, CShao, BTafesse, LYao, JYu, JZhou, X Pyridine compounds and the uses thereof US Patent  US9611222 Publication Date 4/4/2017 
Target
Name:
Sodium channel protein type 9 subunit alpha
Synonyms:
NENA Peripheral sodium channel 1 SCN9A_HUMAN Voltage-gated sodium channel subunit Nav1.7 hNE-Na
Type:
Protein
Mol. Mass.:
226375.97
Organism:
Homo sapiens (Human)
Description:
Q15858
Residue:
1988
  
Inhibitor
Name:
BDBM162425
Synonyms:
US9056832, 44 | US9611222, Example 118
Type:
Small organic molecule
Emp. Form.:
C27H21FN4O2
Mol. Mass.:
452.4796
SMILES:
NC(=O)c1cc(cc(n1)-c1ccc(Oc2ccc(F)cc2)cc1)N(CCC#N)c1ccccc1
: