Target
Sodium channel protein type 9 subunit alpha
Ligand
BDBM162447
Substrate
Meas. Tech.
In Vitro Assay
IC50
130±30 nM
Citation
 Ni, CShao, BTafesse, LYao, JYu, JZhou, X Pyridine compounds and the uses thereof US Patent  US9611222 Publication Date 4/4/2017 
Target
Name:
Sodium channel protein type 9 subunit alpha
Synonyms:
NENA Peripheral sodium channel 1 SCN9A_HUMAN Voltage-gated sodium channel subunit Nav1.7 hNE-Na
Type:
Protein
Mol. Mass.:
226375.97
Organism:
Homo sapiens (Human)
Description:
Q15858
Residue:
1988
  
Inhibitor
Name:
BDBM162447
Synonyms:
US9056832, 66 | US9611222, Example 66
Type:
Small organic molecule
Emp. Form.:
C23H21ClF3N5O2
Mol. Mass.:
491.893
SMILES:
FC(F)(F)c1cnc(Oc2ccc(cc2)-c2cccc(CNCCN3CCNC3=O)n2)c(Cl)c1
: