Target
Sodium channel protein type 9 subunit alpha
Ligand
BDBM162448
Substrate
Meas. Tech.
In Vitro Assay
IC50
170±10 nM
Citation
 Ni, CShao, BTafesse, LYao, JYu, JZhou, X Pyridine compounds and the uses thereof US Patent  US9611222 Publication Date 4/4/2017 
Target
Name:
Sodium channel protein type 9 subunit alpha
Synonyms:
NENA Peripheral sodium channel 1 SCN9A_HUMAN Voltage-gated sodium channel subunit Nav1.7 hNE-Na
Type:
Protein
Mol. Mass.:
226375.97
Organism:
Homo sapiens (Human)
Description:
Q15858
Residue:
1988
  
Inhibitor
Name:
BDBM162448
Synonyms:
US9056832, 67 | US9611222, Example 67
Type:
Small organic molecule
Emp. Form.:
C24H23N5O2
Mol. Mass.:
413.4717
SMILES:
O=C1NCCN1CCNCc1cccc(n1)-c1ccc(Oc2ccc(cc2)C#N)cc1
: