Target
Sodium channel protein type 9 subunit alpha
Ligand
BDBM162467
Substrate
Meas. Tech.
In Vitro Assay
IC50
9210±1150 nM
Citation
 Ni, CShao, BTafesse, LYao, JYu, JZhou, X Pyridine compounds and the uses thereof US Patent  US9611222 Publication Date 4/4/2017 
Target
Name:
Sodium channel protein type 9 subunit alpha
Synonyms:
NENA Peripheral sodium channel 1 SCN9A_HUMAN Voltage-gated sodium channel subunit Nav1.7 hNE-Na
Type:
Protein
Mol. Mass.:
226375.97
Organism:
Homo sapiens (Human)
Description:
Q15858
Residue:
1988
  
Inhibitor
Name:
BDBM162467
Synonyms:
US9056832, 86 | US9611222, Example 86
Type:
Small organic molecule
Emp. Form.:
C26H26FN7O2
Mol. Mass.:
487.5287
SMILES:
Fc1ccc(Oc2ccc(cc2)-c2cc(cc(n2)C(=O)NCCN2CCCCC2)-c2nnn[nH]2)cc1
: