Target
Sodium channel protein type 9 subunit alpha
Ligand
BDBM162469
Substrate
Meas. Tech.
In Vitro Assay
IC50
230±90 nM
Citation
 Ni, CShao, BTafesse, LYao, JYu, JZhou, X Pyridine compounds and the uses thereof US Patent  US9611222 Publication Date 4/4/2017 
Target
Name:
Sodium channel protein type 9 subunit alpha
Synonyms:
NENA Peripheral sodium channel 1 SCN9A_HUMAN Voltage-gated sodium channel subunit Nav1.7 hNE-Na
Type:
Protein
Mol. Mass.:
226375.97
Organism:
Homo sapiens (Human)
Description:
Q15858
Residue:
1988
  
Inhibitor
Name:
BDBM162469
Synonyms:
US9056832, 88 | US9611222, Example 88
Type:
Small organic molecule
Emp. Form.:
C21H20FN3O2
Mol. Mass.:
365.4008
SMILES:
C[C@H](NCc1cccc(n1)-c1ccc(Oc2ccc(F)cc2)cc1)C(N)=O
: