Target
Sodium channel protein type 9 subunit alpha
Ligand
BDBM314273
Substrate
Meas. Tech.
In Vitro Assay
IC50
170±80 nM
Citation
 Ni, CShao, BTafesse, LYao, JYu, JZhou, X Pyridine compounds and the uses thereof US Patent  US9611222 Publication Date 4/4/2017 
Target
Name:
Sodium channel protein type 9 subunit alpha
Synonyms:
NENA Peripheral sodium channel 1 SCN9A_HUMAN Voltage-gated sodium channel subunit Nav1.7 hNE-Na
Type:
Protein
Mol. Mass.:
226375.97
Organism:
Homo sapiens (Human)
Description:
Q15858
Residue:
1988
  
Inhibitor
Name:
BDBM314273
Synonyms:
US9611222, Example 95
Type:
Small organic molecule
Emp. Form.:
C20H16FNO5
Mol. Mass.:
369.3431
SMILES:
OC[C@@H](O)c1cc(cc(n1)C(O)=O)-c1ccc(Oc2ccc(F)cc2)cc1
: