Target
Sodium channel protein type 9 subunit alpha
Ligand
BDBM162523
Substrate
Meas. Tech.
In Vitro Assay
IC50
5300±1600 nM
Citation
 Ni, CShao, BTafesse, LYao, JYu, JZhou, X Pyridine compounds and the uses thereof US Patent  US9611222 Publication Date 4/4/2017 
Target
Name:
Sodium channel protein type 9 subunit alpha
Synonyms:
NENA Peripheral sodium channel 1 SCN9A_HUMAN Voltage-gated sodium channel subunit Nav1.7 hNE-Na
Type:
Protein
Mol. Mass.:
226375.97
Organism:
Homo sapiens (Human)
Description:
Q15858
Residue:
1988
  
Inhibitor
Name:
BDBM162523
Synonyms:
US9056832, 142 | US9611222, Example 142
Type:
Small organic molecule
Emp. Form.:
C20H17FN2O4
Mol. Mass.:
368.3584
SMILES:
NC(=O)c1cc(cc(n1)-c1cccc(Oc2ccc(F)cc2)c1)[C@@H](O)CO
: