Target
Sodium channel protein type 9 subunit alpha
Ligand
BDBM162524
Substrate
Meas. Tech.
In Vitro Assay
IC50
>20000±n/a nM
Citation
 Ni, CShao, BTafesse, LYao, JYu, JZhou, X Pyridine compounds and the uses thereof US Patent  US9611222 Publication Date 4/4/2017 
Target
Name:
Sodium channel protein type 9 subunit alpha
Synonyms:
NENA Peripheral sodium channel 1 SCN9A_HUMAN Voltage-gated sodium channel subunit Nav1.7 hNE-Na
Type:
Protein
Mol. Mass.:
226375.97
Organism:
Homo sapiens (Human)
Description:
Q15858
Residue:
1988
  
Inhibitor
Name:
BDBM162524
Synonyms:
US9056832, 143 | US9611222, Example 143
Type:
Small organic molecule
Emp. Form.:
C26H20FN3O4
Mol. Mass.:
457.4531
SMILES:
NC(=O)c1cc(cc(n1)N(CC(O)=O)c1ccccc1)-c1ccc(Oc2ccc(F)cc2)cc1
: