Target
Sodium channel protein type 9 subunit alpha
Ligand
BDBM162528
Substrate
Meas. Tech.
In Vitro Assay
IC50
1600±260 nM
Citation
 Ni, CShao, BTafesse, LYao, JYu, JZhou, X Pyridine compounds and the uses thereof US Patent  US9611222 Publication Date 4/4/2017 
Target
Name:
Sodium channel protein type 9 subunit alpha
Synonyms:
NENA Peripheral sodium channel 1 SCN9A_HUMAN Voltage-gated sodium channel subunit Nav1.7 hNE-Na
Type:
Protein
Mol. Mass.:
226375.97
Organism:
Homo sapiens (Human)
Description:
Q15858
Residue:
1988
  
Inhibitor
Name:
BDBM162528
Synonyms:
US9056832, 147 | US9611222, Example 147
Type:
Small organic molecule
Emp. Form.:
C26H20N4O2
Mol. Mass.:
420.4626
SMILES:
CN(c1ccccc1)c1cc(nc(c1)-c1ccc(Oc2ccc(cc2)C#N)cc1)C(N)=O
: