Target
Baculoviral IAP repeat-containing protein 2
Ligand
BDBM314173
Substrate
Meas. Tech.
TR-FRET Assay
IC50
32.0±n/a nM
Citation
 Han, XLou, YMichoud, CMischke, SGRemiszewski, SRupert, KC Antiproliferative benzo [B] azepin-2-ones US Patent  US9611224 Publication Date 4/4/2017 
Target
Name:
Baculoviral IAP repeat-containing protein 2
Synonyms:
API1 BIRC2_HUMAN Cellular inhibitor of apoptosis 1 MIHB | RNF48
Type:
Protein
Mol. Mass.:
69900.47
Organism:
Homo sapiens (Human)
Description:
Q13490
Residue:
618
  
Inhibitor
Name:
BDBM314173
Synonyms:
(S)-2-amino-N—((S)-1-((3-methoxyquinolin-4-yl)methyl)-2-oxo-2,3,4,5-tetrahydro-1H-benzo[b]azepin-3-yl)butanamide | US9611224, Example 3
Type:
Small organic molecule
Emp. Form.:
C25H28N4O3
Mol. Mass.:
432.5148
SMILES:
CC[C@H](N)C(=O)N[C@H]1CCc2ccccc2N(Cc2c(OC)cnc3ccccc23)C1=O
: