Target
Baculoviral IAP repeat-containing protein 2
Ligand
BDBM314239
Substrate
Meas. Tech.
TR-FRET Assay
IC50
61.0±n/a nM
Citation
 Han, XLou, YMichoud, CMischke, SGRemiszewski, SRupert, KC Antiproliferative benzo [B] azepin-2-ones US Patent  US9611224 Publication Date 4/4/2017 
Target
Name:
Baculoviral IAP repeat-containing protein 2
Synonyms:
API1 BIRC2_HUMAN Cellular inhibitor of apoptosis 1 MIHB | RNF48
Type:
Protein
Mol. Mass.:
69900.47
Organism:
Homo sapiens (Human)
Description:
Q13490
Residue:
618
  
Inhibitor
Name:
BDBM314239
Synonyms:
6-Methoxy-5-[(S)-3-((S)-2-methylamino-propionylamino)-2-oxo-2,3,4,5-tetrahydro-benzo[b]azepin-1-ylmethyl]-naphthalene-2-carboxylic acid | US9611224, Example 51
Type:
Small organic molecule
Emp. Form.:
C27H29N3O5
Mol. Mass.:
475.5363
SMILES:
CN[C@@H](C)C(=O)N[C@H]1CCc2ccccc2N(Cc2c(OC)ccc3cc(ccc23)C(O)=O)C1=O
: