Target
Baculoviral IAP repeat-containing protein 3
Ligand
BDBM50441354
Substrate
Meas. Tech.
TR-FRET Assay
IC50
>54200±n/a nM
Citation
 Han, XLou, YMichoud, CMischke, SGRemiszewski, SRupert, KC Antiproliferative benzo [B] azepin-2-ones US Patent  US9611224 Publication Date 4/4/2017 
Target
Name:
Baculoviral IAP repeat-containing protein 3
Synonyms:
API2 BIRC3_HUMAN Baculoviral IAP repeat-containing protein 3 (IAP1 BIR3) MIHC XIAP-BIR3 | cIAP1/cIAP2
Type:
Protein
Mol. Mass.:
68365.75
Organism:
Homo sapiens (Human)
Description:
Q13489
Residue:
604
  
Inhibitor
Name:
BDBM50441354
Synonyms:
CHEMBL2431770 | US9611224, Example 55e
Type:
Small organic molecule
Emp. Form.:
C21H25N3O2
Mol. Mass.:
351.4421
SMILES:
CN[C@@H](C)C(=O)N[C@H]1CCc2ccccc2N(Cc2ccccc2)C1=O
: